follow me

Pythonのhashlibが使えない

Pythonのhashlibが使えない。
OpenWrtではまったから残しておこう。
複数Python入れてたり、クロスビルド環境として一時環境作ってたりすると起こるケースがままありそう。
普通にOpenSSLのライブラリが見える位置にいるのかという話ではあるのだが、Pythonをやらない人からすると面倒くさいのです。
しかも、nodeのビルドをしたいだけなのに、Pythonのhashlibとかではまるとか考えないのですよ。

ちなみに、OpenWrtでビルドできなかったときのメッセージはこうなってました。
make[3]: Entering directory '/home/dev/LinkIt7688/chaos_calmer-15.05.1/feeds/packages/lang/node'
(cd /home/dev/LinkIt7688/chaos_calmer-15.05.1/build_dir/host/node-v0.12.7/; if [ -x configure ]; then cp -fpR /home/dev/LinkIt7688/chaos_calmer-15.05.1/scripts/config.{guess,sub} /home/dev/LinkIt7688/chaos_calmer-15.05.1/build_dir/host/node-v0.12.7// &&  python ./configure  --dest-os=linux --without-snapshot --prefix=/home/dev/LinkIt7688/chaos_calmer-15.05.1/staging_dir/host/ ; fi )
ERROR:root:code for hash md5 was not found.
Traceback (most recent call last):
  File "/home/dev/LinkIt7688/chaos_calmer-15.05.1/staging_dir/host/lib/python2.7/hashlib.py", line 147, in 
    globals()[__func_name] = __get_hash(__func_name)
  File "/home/dev/LinkIt7688/chaos_calmer-15.05.1/staging_dir/host/lib/python2.7/hashlib.py", line 97, in __get_builtin_constructor
    raise ValueError('unsupported hash type ' + name)
ValueError: unsupported hash type md5
ERROR:root:code for hash sha1 was not found.
Traceback (most recent call last):
  File "/home/dev/LinkIt7688/chaos_calmer-15.05.1/staging_dir/host/lib/python2.7/hashlib.py", line 147, in 
    globals()[__func_name] = __get_hash(__func_name)
  File "/home/dev/LinkIt7688/chaos_calmer-15.05.1/staging_dir/host/lib/python2.7/hashlib.py", line 97, in __get_builtin_constructor
    raise ValueError('unsupported hash type ' + name)
ValueError: unsupported hash type sha1
ERROR:root:code for hash sha224 was not found.
Traceback (most recent call last):
  File "/home/dev/LinkIt7688/chaos_calmer-15.05.1/staging_dir/host/lib/python2.7/hashlib.py", line 147, in 
    globals()[__func_name] = __get_hash(__func_name)
  File "/home/dev/LinkIt7688/chaos_calmer-15.05.1/staging_dir/host/lib/python2.7/hashlib.py", line 97, in __get_builtin_constructor
    raise ValueError('unsupported hash type ' + name)
ValueError: unsupported hash type sha224
ERROR:root:code for hash sha256 was not found.
Traceback (most recent call last):
  File "/home/dev/LinkIt7688/chaos_calmer-15.05.1/staging_dir/host/lib/python2.7/hashlib.py", line 147, in 
    globals()[__func_name] = __get_hash(__func_name)
  File "/home/dev/LinkIt7688/chaos_calmer-15.05.1/staging_dir/host/lib/python2.7/hashlib.py", line 97, in __get_builtin_constructor
    raise ValueError('unsupported hash type ' + name)
ValueError: unsupported hash type sha256
ERROR:root:code for hash sha384 was not found.
Traceback (most recent call last):
  File "/home/dev/LinkIt7688/chaos_calmer-15.05.1/staging_dir/host/lib/python2.7/hashlib.py", line 147, in 
    globals()[__func_name] = __get_hash(__func_name)
  File "/home/dev/LinkIt7688/chaos_calmer-15.05.1/staging_dir/host/lib/python2.7/hashlib.py", line 97, in __get_builtin_constructor
    raise ValueError('unsupported hash type ' + name)
ValueError: unsupported hash type sha384
ERROR:root:code for hash sha512 was not found.
Traceback (most recent call last):
  File "/home/dev/LinkIt7688/chaos_calmer-15.05.1/staging_dir/host/lib/python2.7/hashlib.py", line 147, in 
    globals()[__func_name] = __get_hash(__func_name)
  File "/home/dev/LinkIt7688/chaos_calmer-15.05.1/staging_dir/host/lib/python2.7/hashlib.py", line 97, in __get_builtin_constructor
    raise ValueError('unsupported hash type ' + name)
ValueError: unsupported hash type sha512
Traceback (most recent call last):
  File "./configure", line 992, in 
    configure_node(output)
  File "./configure", line 530, in configure_node
    o['variables']['gcc_version'] = 10 * cc_version[0] + cc_version[1]
IndexError: tuple index out of range
Makefile:72: recipe for target '/home/dev/LinkIt7688/chaos_calmer-15.05.1/build_dir/host/node-v0.12.7/.configured' failed
make[3]: *** [/home/dev/LinkIt7688/chaos_calmer-15.05.1/build_dir/host/node-v0.12.7/.configured] Error 1
make[3]: Leaving directory '/home/dev/LinkIt7688/chaos_calmer-15.05.1/feeds/packages/lang/node'
package/Makefile:191: recipe for target 'package/feeds/packages/node/host/compile' failed
make[2]: *** [package/feeds/packages/node/host/compile] Error 2
make[2]: Leaving directory '/home/dev/LinkIt7688/chaos_calmer-15.05.1'
package/Makefile:188: recipe for target '/home/dev/LinkIt7688/chaos_calmer-15.05.1/staging_dir/target-mipsel_24kec+dsp_uClibc-0.9.33.2/stamp/.package_compile' failed
make[1]: *** [/home/dev/LinkIt7688/chaos_calmer-15.05.1/staging_dir/target-mipsel_24kec+dsp_uClibc-0.9.33.2/stamp/.package_compile] Error 2
make[1]: Leaving directory '/home/dev/LinkIt7688/chaos_calmer-15.05.1'
/home/dev/LinkIt7688/chaos_calmer-15.05.1/include/toplevel.mk:181: recipe for target 'world' failed
make: *** [world] Error 2
follow me

アキバぶら歩き(2019/01/19)

毎週の様にぶらぶらしなくなった街、秋葉原。
もういいかな感にあふれてきた街、アキバと秋葉原。
2019/01/19(土)、ぶらぶらした戦利品記録です。

例のグラボ、例の電源、例のCPUマザボのセット。
なんでも「例の」にしてしまう秋葉原一色。
いや、安く入手できるのは嬉しいのですがね。

つくもたん.ex
BD-R買うとつくもたんカレンダーついてくるのが始まったみたいだけど、買わなかったという珍しい2019年です。
いえね、BD-Rあんま使わないんですよね、けっきょく。。。